Reaction Details
TargetBromodomain-containing protein 4
LigandBDBM50200375
Substrate/Competitorn/a
Meas. Tech.ChEBML_1622038
IC50 4600±n/a nM
Citation Crawford, TDRomero, FALai, KWTsui, VTaylor, AMde Leon Boenig, GNoland, CLMurray, JLy, JChoo, EFHunsaker, TLChan, EWMerchant, MKharbanda, SGascoigne, KEKaufman, SBeresini, MHLiao, JLiu, WChen, KXChen, ZConery, ARCôté, AJayaram, HJiang, YKiefer, JRKleinheinz, TLi, YMaher, JPardo, EPoy, FSpillane, KLWang, FWang, JWei, XXu, ZXu, ZYen, IZawadzke, LZhu, XBellon, SCummings, RCochran, AGAlbrecht, BKMagnuson, S Discovery of a Potent and Selective in Vivo Probe (GNE-272) for the Bromodomains of CBP/EP300. J Med Chem59:10549-10563 (2016) 
 
Bromodomain-containing protein 4
Name:Bromodomain-containing protein 4
Type:Protein
Mol. Mass.:152264.84
Organism:Homo sapiens (Human)
Description:O60885
Residue:1362
BDBM50200375
NameBDBM50200375
Synonyms:CHEMBL3902514
TypeSmall organic molecule
Emp. Form.C24H26N4O
Mol. Mass.386.4894
SMILESCC(=O)N1CCc2c(C1)c(Nc1cccc(c1)-c1ccccc1)nn2CC1CC1