Reaction Details
TargetSodium channel protein type 5 subunit alpha
LigandBDBM50201179
Substrate/Competitorn/a
Meas. Tech.ChEMBL_1622981 (CHEMBL3865333)
IC50>30000±n/a nM
Citation Marx, IEDineen, TAAble, JBode, CBregman, HChu-Moyer, MDiMauro, EFDu, BFoti, RSFremeau, RTGao, HGunaydin, HHall, BEHuang, LKornecook, TKreiman, CRLa, DSLigutti, JLin, MJLiu, DMcDermott, JSMoyer, BDPeterson, EARoberts, JTRose, PWang, JYoungblood, BDYu, VWeiss, MM Sulfonamides as Selective Na ACS Med Chem Lett7:1062-1067 (2016) 
 
Sodium channel protein type 5 subunit alpha
Name:Sodium channel protein type 5 subunit alpha
Type:Enzyme
Mol. Mass.:226908.60
Organism:Homo sapiens (Human)
Description:Q14524
Residue:2016
BDBM50201179
NameBDBM50201179
Synonyms:CHEMBL2325007
TypeSmall organic molecule
Emp. Form.C19H11F3N6O3S2
Mol. Mass.492.454
SMILESFC(F)(F)c1ccc(Oc2ccc(cc2C#N)S(=O)(=O)Nc2ncns2)c(c1)-c1cn[nH]c1