Reaction Details
TargetBiotin--protein ligase
LigandBDBM50201196
Substrate/Competitorn/a
Meas. Tech.ChEMBL_1623040 (CHEMBL3865392)
Ki>16000±n/a nM
Citation Feng, JPaparella, ASTieu, WHeim, DClark, SHayes, ABooker, GWPolyak, SWAbell, AD New Series of BPL Inhibitors To Probe the Ribose-Binding Pocket of ACS Med Chem Lett7:1068-1072 (2016) 
 
Biotin--protein ligase
Name:Biotin--protein ligase
Type:PROTEIN
Mol. Mass.:80745.43
Organism:Homo sapiens (Human)
Description:ChEMBL_1475435
Residue:726
BDBM50201196
NameBDBM50201196
Synonyms:CHEMBL3961751
TypeSmall organic molecule
Emp. Form.C19H24IN5OS
Mol. Mass.497.396
SMILES[H][C@]12CS[C@@H](CCCCCc3cn(Cc4cccc(I)c4)nn3)[C@@]1([H])NC(=O)N2