Reaction Details
TargetCysteine protease ATG4B
LigandBDBM4078
Substrate/Competitorn/a
Meas. Tech.ChEMBL_1628065 (CHEMBL3870650)
IC50 5500±n/a nM
Citation Cleenewerck, MGrootaert, MOJGladysz, RAdriaenssens, YRoelandt, RJoossens, JLambeir, AMDe Meyer, GRYDeclercq, WAugustyns, KMartinet, WVan der Veken, P Inhibitor screening and enzymatic activity determination for autophagy target Atg4B using a gel electrophoresis-based assay. Eur J Med Chem123:631-638 (2016) 
 
Cysteine protease ATG4B
Name:Cysteine protease ATG4B
Type:Enzyme Catalytic Domain
Mol. Mass.:44279.79
Organism:Homo sapiens (Human)
Description:gi_47132611
Residue:393
BDBM4078
NameBDBM4078
Synonyms:6,7,13,14-tetrahydroxy-2,9-dioxatetracyclo[6.6.2.0^{4,16}.0^{11,15}]hexadeca-1(14),4(16),5,7,11(15),12-hexaene-3,10-dione ELLAGIC ACID Ellagic acid (18) MLS000069632 cid_5281855
TypeSmall organic molecule
Emp. Form.C14H6O8
Mol. Mass.302.1926
SMILESOc1cc2c3c(oc(=O)c4cc(O)c(O)c(oc2=O)c34)c1O