Reaction Details
TargetCytochrome P450 11B2, mitochondrial
LigandBDBM50206208
Substrate/Competitorn/a
Meas. Tech.ChEMBL_1628625 (CHEMBL3871210)
IC50 13±n/a nM
Citation Petrilli, WLHoyt, SBLondon, CMcMasters, DVerras, AStruthers, MCully, DWisniewski, TRen, NBopp, CSok, AChen, QLi, YTung, ETang, WSalituro, GKnemeyer, IKaranam, BClemas, JZhou, GGibson, JShipley, CAMacNeil, DJDuffy, RTata, JRUjjainwalla, FAli, AXiong, Y Discovery of Spirocyclic Aldosterone Synthase Inhibitors as Potential Treatments for Resistant Hypertension. ACS Med Chem Lett8:128-132 (2017) 
 
Cytochrome P450 11B2, mitochondrial
Name:Cytochrome P450 11B2, mitochondrial
Type:Protein
Mol. Mass.:57582.15
Organism:Homo sapiens (Human)
Description:P19099
Residue:503
BDBM50206208
NameBDBM50206208
Synonyms:CHEMBL3889825
TypeSmall organic molecule
Emp. Form.C17H20N2O
Mol. Mass.268.3535
SMILESC1CC2(CO1)CCN(CC2)c1cncc2ccccc12