Reaction Details
TargetCytochrome P450 11B2, mitochondrial
LigandBDBM50206214
Substrate/Competitorn/a
Meas. Tech.ChEMBL_1628625 (CHEMBL3871210)
IC50 13±n/a nM
Citation Petrilli, WLHoyt, SBLondon, CMcMasters, DVerras, AStruthers, MCully, DWisniewski, TRen, NBopp, CSok, AChen, QLi, YTung, ETang, WSalituro, GKnemeyer, IKaranam, BClemas, JZhou, GGibson, JShipley, CAMacNeil, DJDuffy, RTata, JRUjjainwalla, FAli, AXiong, Y Discovery of Spirocyclic Aldosterone Synthase Inhibitors as Potential Treatments for Resistant Hypertension. ACS Med Chem Lett8:128-132 (2017) 
 
Cytochrome P450 11B2, mitochondrial
Name:Cytochrome P450 11B2, mitochondrial
Type:Protein
Mol. Mass.:57582.15
Organism:Homo sapiens (Human)
Description:P19099
Residue:503
BDBM50206214
NameBDBM50206214
Synonyms:CHEMBL3973937
TypeSmall organic molecule
Emp. Form.C16H21F3N2O2
Mol. Mass.330.3453
SMILESC[C@](O)(c1cncc(c1)N1CCC2(CCOC2)CC1)C(F)(F)F