Reaction Details
TargetDNA (cytosine-5)-methyltransferase 3A
LigandBDBM50206868
Substrate/Competitorn/a
Meas. Tech.ChEMBL_1629346 (CHEMBL3871972)
IC50 46500±n/a nM
Citation Shao, ZXu, PXu, WLi, LLiu, SZhang, RLiu, YCZhang, CChen, SLuo, C Discovery of novel DNA methyltransferase 3A inhibitors via structure-based virtual screening and biological assays. Bioorg Med Chem Lett27:342-346 (2017) 
 
DNA (cytosine-5)-methyltransferase 3A
Name:DNA (cytosine-5)-methyltransferase 3A
Type:PROTEIN
Mol. Mass.:101857.24
Organism:Homo sapiens (Human)
Description:ChEMBL_1510405
Residue:912
BDBM50206868
NameBDBM50206868
Synonyms:CHEMBL1424505
TypeSmall organic molecule
Emp. Form.C24H17BrN2O5
Mol. Mass.493.306
SMILESCC(N1C(=O)c2ccc(cc2C1=O)C(=O)Nc1ccc(Br)cc1C(O)=O)c1ccccc1