Reaction Details
TargetGlycogen phosphorylase, muscle form
LigandBDBM50148913
Substrate/Competitorn/a
Meas. Tech.ChEMBL_1630550 (CHEMBL3873256)
Ki 65±n/a nM
Citation Kantsadi, ALBokor, ÉKun, SStravodimos, GAChatzileontiadou, DSMLeonidas, DDJuhász-Tóth, ÉSzakács, ABatta, GDocsa, TGergely, PSomsák, L Synthetic, enzyme kinetic, and protein crystallographic studies of C-ß-d-glucopyranosyl pyrroles and imidazoles reveal and explain low nanomolar inhibition of human liver glycogen phosphorylase. Eur J Med Chem123:737-745 (2016) 
 
Glycogen phosphorylase, muscle form
Name:Glycogen phosphorylase, muscle form
Type:Enzyme
Mol. Mass.:97296.32
Organism:Oryctolagus cuniculus (rabbit)
Description:Phosphorylation of Ser-15 converts phosphorylase B (unphosphorylated) to phosphorylase A.
Residue:843
BDBM50148913
NameBDBM50148913
Synonyms:CHEMBL3770455
TypeSmall organic molecule
Emp. Form.C19H20N2O5
Mol. Mass.356.3725
SMILESOC[C@H]1O[C@H]([C@H](O)[C@@H](O)[C@@H]1O)c1nc(c[nH]1)-c1ccc2ccccc2c1