Reaction Details
TargetProtein-tyrosine kinase 2-beta
LigandBDBM50207361
Substrate/Competitorn/a
Meas. Tech.ChEMBL_1630970 (CHEMBL3873676)
IC50 3.1±n/a nM
Citation Farand, JMai, NChandrasekhar, JNewby, ZEVan Veldhuizen, JLoyer-Drew, JVenkataramani, CGuerrero, JKwok, ALi, NZherebina, YWilbert, SZablocki, JPhillips, GWatkins, WJMourey, RNotte, GT Selectivity switch between FAK and Pyk2: Macrocyclization of FAK inhibitors improves Pyk2 potency. Bioorg Med Chem Lett26:5926-5930 (2016) 
 
Protein-tyrosine kinase 2-beta
Name:Protein-tyrosine kinase 2-beta
Type:Protein
Mol. Mass.:115868.80
Organism:Homo sapiens (Human)
Description:Q14289
Residue:1009
BDBM50207361
NameBDBM50207361
Synonyms:CHEMBL3889951
TypeSmall organic molecule
Emp. Form.C25H26F3N7O3S
Mol. Mass.561.579
SMILESCS(=O)(=O)N1CCCCC(=O)N2CCc3cc(Nc4ncc(c(NCc5cccnc15)n4)C(F)(F)F)ccc23