Reaction Details
TargetProtein-tyrosine kinase 2-beta
LigandBDBM50207362
Substrate/Competitorn/a
Meas. Tech.ChEMBL_1630970 (CHEMBL3873676)
IC50 2.7±n/a nM
Citation Farand, JMai, NChandrasekhar, JNewby, ZEVan Veldhuizen, JLoyer-Drew, JVenkataramani, CGuerrero, JKwok, ALi, NZherebina, YWilbert, SZablocki, JPhillips, GWatkins, WJMourey, RNotte, GT Selectivity switch between FAK and Pyk2: Macrocyclization of FAK inhibitors improves Pyk2 potency. Bioorg Med Chem Lett26:5926-5930 (2016) 
 
Protein-tyrosine kinase 2-beta
Name:Protein-tyrosine kinase 2-beta
Type:Protein
Mol. Mass.:115868.80
Organism:Homo sapiens (Human)
Description:Q14289
Residue:1009
BDBM50207362
NameBDBM50207362
Synonyms:CHEMBL3977870
TypeSmall organic molecule
Emp. Form.C26H28F3N7O3S
Mol. Mass.575.606
SMILESCN1Cc2ccncc2N(C\C=C\c2cc(Nc3ncc(c1n3)C(F)(F)F)ccc2N1CCOCC1)S(C)(=O)=O