Reaction Details
TargetFocal adhesion kinase 1
LigandBDBM50207349
Substrate/Competitorn/a
Meas. Tech.ChEMBL_1630971 (CHEMBL3873677)
IC50 4.3±n/a nM
Citation Farand, JMai, NChandrasekhar, JNewby, ZEVan Veldhuizen, JLoyer-Drew, JVenkataramani, CGuerrero, JKwok, ALi, NZherebina, YWilbert, SZablocki, JPhillips, GWatkins, WJMourey, RNotte, GT Selectivity switch between FAK and Pyk2: Macrocyclization of FAK inhibitors improves Pyk2 potency. Bioorg Med Chem Lett26:5926-5930 (2016) 
 
Focal adhesion kinase 1
Name:Focal adhesion kinase 1
Type:Tyrosine-protein kinase
Mol. Mass.:119233.17
Organism:Homo sapiens (Human)
Description:Q05397
Residue:1052
BDBM50207349
NameBDBM50207349
Synonyms:CHEMBL3958414
TypeSmall organic molecule
Emp. Form.C25H26F3N7O3S
Mol. Mass.561.579
SMILESCS(=O)(=O)N1C\C=C\c2cc(Nc3ncc(c(NCc4cccnc14)n3)C(F)(F)F)ccc2N1CCOCC1