Reaction Details
TargetFocal adhesion kinase 1
LigandBDBM50207355
Substrate/Competitorn/a
Meas. Tech.ChEMBL_1630971 (CHEMBL3873677)
IC50 3.2±n/a nM
Citation Farand, JMai, NChandrasekhar, JNewby, ZEVan Veldhuizen, JLoyer-Drew, JVenkataramani, CGuerrero, JKwok, ALi, NZherebina, YWilbert, SZablocki, JPhillips, GWatkins, WJMourey, RNotte, GT Selectivity switch between FAK and Pyk2: Macrocyclization of FAK inhibitors improves Pyk2 potency. Bioorg Med Chem Lett26:5926-5930 (2016) 
 
Focal adhesion kinase 1
Name:Focal adhesion kinase 1
Type:Tyrosine-protein kinase
Mol. Mass.:119233.17
Organism:Homo sapiens (Human)
Description:Q05397
Residue:1052
BDBM50207355
NameBDBM50207355
Synonyms:CHEMBL3987106
TypeSmall organic molecule
Emp. Form.C25H28F3N7O3S
Mol. Mass.563.595
SMILESCS(=O)(=O)N1CCCc2cc(Nc3ncc(c(NCc4cccnc14)n3)C(F)(F)F)ccc2N1CCOCC1