Reaction Details
TargetCysteinyl leukotriene receptor 1
LigandBDBM50207398
Substrate/Competitorn/a
Meas. Tech.ChEMBL_1631170 (CHEMBL3873876)
IC50 112±n/a nM
Citation Blanco, MJBenesh, DRKnobelsdorf, JAKhilevich, ACortez, GSMokube, FAicher, TDGroendyke, TMMarmsater, FPTang, TPJohnson, KWClemens-Smith, AMuhlhauser, MASwanson, SCatlow, JEmkey, RJohnson, MPSchkeryantz, JM Discovery of dual positive allosteric modulators (PAMs) of the metabotropic glutamate 2 receptor and CysLT1 antagonists for treating migraine headache. Bioorg Med Chem Lett27:323-328 (2017) 
 
Cysteinyl leukotriene receptor 1
Name:Cysteinyl leukotriene receptor 1
Type:Enzyme Catalytic Domain
Mol. Mass.:38565.16
Organism:Homo sapiens (Human)
Description:Leukotriene Cysteinyl 1 CYSLTR1 HUMAN::Q9Y271
Residue:337
BDBM50207398
NameBDBM50207398
Synonyms:CHEMBL3965244
TypeSmall organic molecule
Emp. Form.C22H16F3N5O4
Mol. Mass.471.3887
SMILESCC(=O)c1ccc(OCc2cccc(Oc3cc(ccn3)-c3nn[nH]n3)c2)c(c1O)C(F)(F)F