Reaction Details
TargetMetabotropic glutamate receptor 2
LigandBDBM50207410
Substrate/Competitorn/a
Meas. Tech.ChEMBL_1631168 (CHEMBL3873874)
EC50 110±n/a nM
Citation Blanco, MJBenesh, DRKnobelsdorf, JAKhilevich, ACortez, GSMokube, FAicher, TDGroendyke, TMMarmsater, FPTang, TPJohnson, KWClemens-Smith, AMuhlhauser, MASwanson, SCatlow, JEmkey, RJohnson, MPSchkeryantz, JM Discovery of dual positive allosteric modulators (PAMs) of the metabotropic glutamate 2 receptor and CysLT1 antagonists for treating migraine headache. Bioorg Med Chem Lett27:323-328 (2017) 
 
Metabotropic glutamate receptor 2
Name:Metabotropic glutamate receptor 2
Type:Enzyme
Mol. Mass.:95584.88
Organism:Homo sapiens (Human)
Description:Q14416
Residue:872
BDBM50207410
NameBDBM50207410
Synonyms:CHEMBL3909995
TypeSmall organic molecule
Emp. Form.C24H23N5O4
Mol. Mass.445.4705
SMILESCCCc1c(OCc2cccc(Oc3cc(ccn3)-c3nn[nH]n3)c2)ccc(C(C)=O)c1O