Reaction Details
TargetMuscarinic acetylcholine receptor M4
LigandBDBM50207520
Substrate/Competitorn/a
Meas. Tech.ChEMBL_1631981 (CHEMBL3874687)
EC50 150±n/a nM
Citation Wood, MRNoetzel, MJPoslusney, MSMelancon, BJTarr, JCLamsal, AChang, SLuscombe, VBWeiner, RLCho, HPBubser, MJones, CKNiswender, CMWood, MWEngers, DWBrandon, NJDuggan, MEConn, PJBridges, TMLindsley, CW Challenges in the development of an M Bioorg Med Chem Lett27:171-175 (2017) 
 
Muscarinic acetylcholine receptor M4
Name:Muscarinic acetylcholine receptor M4
Type:Enzyme Catalytic Domain
Mol. Mass.:53079.31
Organism:Homo sapiens (Human)
Description:Cholinergic, muscarinic M4 CHRM4 HUMAN M3::P08173
Residue:479
BDBM50207520
NameBDBM50207520
Synonyms:CHEMBL3933538
TypeSmall organic molecule
Emp. Form.C17H18N4O2S
Mol. Mass.342.415
SMILESCOc1ccc(CNC(=O)c2sc3nnc(C)c(C)c3c2N)cc1