Reaction Details
TargetMuscarinic acetylcholine receptor M1
LigandBDBM50207463
Substrate/Competitorn/a
Meas. Tech.ChEMBL_1632013 (CHEMBL3874719)
EC50>30000±n/a nM
Citation Wood, MRNoetzel, MJPoslusney, MSMelancon, BJTarr, JCLamsal, AChang, SLuscombe, VBWeiner, RLCho, HPBubser, MJones, CKNiswender, CMWood, MWEngers, DWBrandon, NJDuggan, MEConn, PJBridges, TMLindsley, CW Challenges in the development of an M Bioorg Med Chem Lett27:171-175 (2017) 
 
Muscarinic acetylcholine receptor M1
Name:Muscarinic acetylcholine receptor M1
Type:Enzyme Catalytic Domain
Mol. Mass.:51390.46
Organism:RAT
Description:P08482
Residue:460
BDBM50207463
NameBDBM50207463
Synonyms:CHEMBL3963788
TypeSmall organic molecule
Emp. Form.C17H16F2N4O3S2
Mol. Mass.426.461
SMILESCc1nnc2sc(C(=O)NCc3ccc(cc3)S(=O)(=O)C(F)F)c(N)c2c1C