Reaction Details
TargetMuscarinic acetylcholine receptor M3
LigandBDBM50207463
Substrate/Competitorn/a
Meas. Tech.ChEMBL_1632015 (CHEMBL3874721)
EC50>30000±n/a nM
Citation Wood, MRNoetzel, MJPoslusney, MSMelancon, BJTarr, JCLamsal, AChang, SLuscombe, VBWeiner, RLCho, HPBubser, MJones, CKNiswender, CMWood, MWEngers, DWBrandon, NJDuggan, MEConn, PJBridges, TMLindsley, CW Challenges in the development of an M Bioorg Med Chem Lett27:171-175 (2017) 
 
Muscarinic acetylcholine receptor M3
Name:Muscarinic acetylcholine receptor M3
Type:Enzyme Catalytic Domain
Mol. Mass.:66086.66
Organism:RAT
Description:Cholinergic, muscarinic M3 CHRM3 RAT::P08483
Residue:589
BDBM50207463
NameBDBM50207463
Synonyms:CHEMBL3963788
TypeSmall organic molecule
Emp. Form.C17H16F2N4O3S2
Mol. Mass.426.461
SMILESCc1nnc2sc(C(=O)NCc3ccc(cc3)S(=O)(=O)C(F)F)c(N)c2c1C