Reaction Details
TargetMuscarinic acetylcholine receptor M4
LigandBDBM50207527
Substrate/Competitorn/a
Meas. Tech.ChEMBL_1631985 (CHEMBL3874691)
EC50 138±n/a nM
Citation Wood, MRNoetzel, MJPoslusney, MSMelancon, BJTarr, JCLamsal, AChang, SLuscombe, VBWeiner, RLCho, HPBubser, MJones, CKNiswender, CMWood, MWEngers, DWBrandon, NJDuggan, MEConn, PJBridges, TMLindsley, CW Challenges in the development of an M Bioorg Med Chem Lett27:171-175 (2017) 
 
Muscarinic acetylcholine receptor M4
Name:Muscarinic acetylcholine receptor M4
Type:Enzyme Catalytic Domain
Mol. Mass.:52841.70
Organism:RAT
Description:Cholinergic, muscarinic M4 CHRM4 RAT::P08485
Residue:477
BDBM50207527
NameBDBM50207527
Synonyms:CHEMBL3903798
TypeSmall organic molecule
Emp. Form.C17H18N4O2S2
Mol. Mass.374.48
SMILESC[S+]([O-])c1ccc(CNC(=O)c2sc3nnc(C)c(C)c3c2N)cc1