Reaction Details
TargetCoagulation factor X
LigandBDBM50210072
Substrate/Competitorn/a
Meas. Tech.ChEMBL_1634324 (CHEMBL3877116)
IC50>1000000±n/a nM
Citation Li, ZPartridge, JSilva-Garcia, ARademacher, PBetz, AXu, QSham, HHu, YShan, YLiu, BZhang, YShi, HXu, QMa, XZhang, L Structure-Guided Design of Novel, Potent, and Selective Macrocyclic Plasma Kallikrein Inhibitors. ACS Med Chem Lett8:185-190 (2017) 
 
Coagulation factor X
Name:Coagulation factor X
Type:Enzyme
Mol. Mass.:54726.60
Organism:Homo sapiens (Human)
Description:n/a
Residue:488
BDBM50210072
NameBDBM50210072
Synonyms:CHEMBL3884830
TypeSmall organic molecule
Emp. Form.C22H23N7O
Mol. Mass.401.4643
SMILESCc1nc(N)ccc1CNC(=O)c1cnn(Cc2ccc(Cn3cccn3)cc2)c1