Reaction Details
TargetCoagulation factor XI
LigandBDBM50210127
Substrate/Competitorn/a
Meas. Tech.ChEMBL_1634333 (CHEMBL3877125)
IC50 3610±n/a nM
Citation Li, ZPartridge, JSilva-Garcia, ARademacher, PBetz, AXu, QSham, HHu, YShan, YLiu, BZhang, YShi, HXu, QMa, XZhang, L Structure-Guided Design of Novel, Potent, and Selective Macrocyclic Plasma Kallikrein Inhibitors. ACS Med Chem Lett8:185-190 (2017) 
 
Coagulation factor XI
Name:Coagulation factor XI
Type:Enzyme
Mol. Mass.:70130.58
Organism:Homo sapiens (Human)
Description:P03951
Residue:625
BDBM50210127
NameBDBM50210127
Synonyms:CHEMBL3884851
TypeSmall organic molecule
Emp. Form.C29H33N7O3
Mol. Mass.527.6174
SMILESCc1nc(N)cc2OCC\C=C\CCCOc3cc(Cn4cccn4)ccc3Cn3cc(cn3)C(=O)NCc12