Reaction Details
TargetProthrombin
LigandBDBM50210072
Substrate/Competitorn/a
Meas. Tech.ChEMBL_1634336 (CHEMBL3877128)
IC50>1000000±n/a nM
Citation Li, ZPartridge, JSilva-Garcia, ARademacher, PBetz, AXu, QSham, HHu, YShan, YLiu, BZhang, YShi, HXu, QMa, XZhang, L Structure-Guided Design of Novel, Potent, and Selective Macrocyclic Plasma Kallikrein Inhibitors. ACS Med Chem Lett8:185-190 (2017) 
 
Prothrombin
Name:Prothrombin
Type:Protein
Mol. Mass.:70029.57
Organism:Homo sapiens (Human)
Description:P00734
Residue:622
BDBM50210072
NameBDBM50210072
Synonyms:CHEMBL3884830
TypeSmall organic molecule
Emp. Form.C22H23N7O
Mol. Mass.401.4643
SMILESCc1nc(N)ccc1CNC(=O)c1cnn(Cc2ccc(Cn3cccn3)cc2)c1