Reaction Details
TargetPlasma kallikrein
LigandBDBM50210073
Substrate/Competitorn/a
Meas. Tech.ChEMBL_1634330 (CHEMBL3877122)
IC50 42±n/a nM
Citation Li, ZPartridge, JSilva-Garcia, ARademacher, PBetz, AXu, QSham, HHu, YShan, YLiu, BZhang, YShi, HXu, QMa, XZhang, L Structure-Guided Design of Novel, Potent, and Selective Macrocyclic Plasma Kallikrein Inhibitors. ACS Med Chem Lett8:185-190 (2017) 
 
Plasma kallikrein
Name:Plasma kallikrein
Type:Protein
Mol. Mass.:71391.16
Organism:Homo sapiens (Human)
Description:P03952
Residue:638
BDBM50210073
NameBDBM50210073
Synonyms:CHEMBL3883461
TypeSmall organic molecule
Emp. Form.C29H33N7O3
Mol. Mass.527.6174
SMILESCc1nc(N)cc2OCC\C=C/CCCOc3cc(Cn4cccn4)ccc3Cn3cc(cn3)C(=O)NCc12