Reaction Details
TargetHeat shock protein HSP 90-alpha
LigandBDBM50210935
Substrate/Competitorn/a
Meas. Tech.ChEMBL_1635598 (CHEMBL3878496)
IC50>1000±n/a nM
Citation Jeong, JHOh, YJLho, YPark, SYLiu, KHHa, ESeo, YH Targeting the entry region of Hsp90's ATP binding pocket with a novel 6,7-dihydrothieno[3,2-c]pyridin-5(4H)-yl amide. Eur J Med Chem124:1069-1080 (2016) 
 
Heat shock protein HSP 90-alpha
Name:Heat shock protein HSP 90-alpha
Type:Molecular Chaperone
Mol. Mass.:84623.45
Organism:Homo sapiens (Human)
Description:P07900
Residue:732
BDBM50210935
NameBDBM50210935
Synonyms:CHEMBL3926941
TypeSmall organic molecule
Emp. Form.C13H8ClNO3
Mol. Mass.261.661
SMILESOc1cc(O)c(cc1Cl)-c1nc2ccccc2o1