Reaction Details
TargetMitogen-activated protein kinase kinase kinase 5
LigandBDBM50212258
Substrate/Competitorn/a
Meas. Tech.ChEMBL_1636848 (CHEMBL3879746)
IC50 5.0±n/a nM
Citation Lanier, MPickens, JBigi, SVBradshaw-Pierce, ELChambers, ACheruvallath, ZSCole, DDougan, DRErmolieff, JGibson, THalkowycz, PHirokawa, AIvetac, AMiura, JNunez, ESabat, MTyhonas, JWang, HWang, XSwann, S Structure-Based Design of ASK1 Inhibitors as Potential Agents for Heart Failure. ACS Med Chem Lett8:316-320 (2017) 
 
Mitogen-activated protein kinase kinase kinase 5
Name:Mitogen-activated protein kinase kinase kinase 5
Type:Protein
Mol. Mass.:154514.93
Organism:Homo sapiens (Human)
Description:Q99683
Residue:1374
BDBM50212258
NameBDBM50212258
Synonyms:GS-4997 | Selonsertib
TypeSmall organic molecule
Emp. Form.C24H24FN7O
Mol. Mass.445.4921
SMILESCC(C)n1cnnc1-c1cccc(NC(=O)c2cc(c(C)cc2F)-n2cnc(c2)C2CC2)n1