Reaction Details
TargetGenome polyprotein
LigandBDBM50216784
Substrate/Competitorn/a
Meas. Tech.ChEMBL_79050 (CHEMBL687026)
IC50 37300±n/a nM
Citation Chu, MMierzwa, RHe, LKing, APatel, MPichardo, JHart, AButkiewicz, NPuar, MS Isolation and structure of SCH 351633: a novel hepatitis C virus (HCV) NS3 protease inhibitor from the fungus Penicillium griseofulvum. Bioorg Med Chem Lett9:1949-52 (1999) Genome polyprotein
Name:Genome polyprotein
Type:Protein
Mol. Mass.:67067.41
Organism:Hepatitis C virus
Description:A3EZI9
Residue:631
BDBM50216784
NameBDBM50216784
Synonyms:CHEMBL60795
TypeSmall organic molecule
Emp. Form.C14H9BrO5
Mol. Mass.337.122
SMILESBrc1ccc(cc1)C(=O)OC1OCC=C2OC(=O)C=C12