Reaction Details
TargetD(3) dopamine receptor
LigandBDBM50217177
Substrate/Competitorn/a
Meas. Tech.ChEMBL_62457 (CHEMBL679229)
Ki 10.0±n/a nM
Citation Austin, NEAvenell, KYBoyfield, IBranch, CLColdwell, MCHadley, MSJeffrey, PJohns, AJohnson, CNNash, DJRiley, GJSmith, SAStacey, RCStemp, GThewlis, KMVong, AK Novel 1,2,3,4-tetrahydroisoquinolines with high affinity and selectivity for the dopamine D3 receptor. Bioorg Med Chem Lett9:179-84 (1999) D(3) dopamine receptor
Name:D(3) dopamine receptor
Type:n/a
Mol. Mass.:44243.43
Organism:Homo sapiens (Human)
Description:n/a
Residue:400
BDBM50217177
NameBDBM50217177
Synonyms:CHEMBL292577
TypeSmall organic molecule
Emp. Form.C27H28F3N3O5S
Mol. Mass.563.589
SMILESCn1c2ccc(\C=C\C(=O)NCCCCN3CCc4ccc(OS(=O)(=O)C(F)(F)F)cc4C3)cc2ccc1=O