Reaction Details
Target5-hydroxytryptamine receptor 2C
LigandBDBM50384416
Substrate/Competitorn/a
Meas. Tech.ChEMBL_2765 (CHEMBL617762)
Ki<5012±n/a nM
Citation Porter, RAChan, WNCoulton, SJohns, AHadley, MSWiddowson, KJerman, JCBrough, SJColdwell, MSmart, DJewitt, FJeffrey, PAustin, N 1,3-Biarylureas as selective non-peptide antagonists of the orexin-1 receptor. Bioorg Med Chem Lett11:1907-10 (2001) 5-hydroxytryptamine receptor 2C
Name:5-hydroxytryptamine receptor 2C
Type:G Protein-Coupled Receptor (GPCR)
Mol. Mass.:51836.79
Organism:Homo sapiens (Human)
Description:P28335
Residue:458
BDBM50384416
NameBDBM50384416
Synonyms:CHEMBL2111553 SB-334867
TypeSmall organic molecule
Emp. Form.C17H13N5O2
Mol. Mass.319.3174
SMILESCc1nc2ccc(NC(=O)Nc3ccnc4cccnc34)cc2o1