Reaction Details
TargetHistamine H3 receptor
LigandBDBM50217099
Substrate/Competitorn/a
Meas. Tech.ChEMBL_86929 (CHEMBL697538)
Ki 25±n/a nM
Citation Faghih, RDwight, WVasudevan, ADinges, JConner, SEEsbenshade, TABennani, YLHancock, AA Aminoalkoxybiphenylnitriles as histamine-3 receptor ligands. Bioorg Med Chem Lett12:3077-9 (2002) Histamine H3 receptor
Name:Histamine H3 receptor
Type:G Protein-Coupled Receptor (GPCR)
Mol. Mass.:48607.98
Organism:Rattus norvegicus (rat)
Description:n/a
Residue:445
BDBM50217099
NameBDBM50217099
Synonyms:CHEMBL106483
TypeSmall organic molecule
Emp. Form.C20H22N2O2
Mol. Mass.322.4009
SMILESN#Cc1ccc(cc1)-c1ccc(OCCCN2CCOCC2)cc1