Reaction Details
TargetHistamine H3 receptor
LigandBDBM50217108
Substrate/Competitorn/a
Meas. Tech.ChEMBL_86929 (CHEMBL697538)
Ki 589±n/a nM
Citation Faghih, RDwight, WVasudevan, ADinges, JConner, SEEsbenshade, TABennani, YLHancock, AA Aminoalkoxybiphenylnitriles as histamine-3 receptor ligands. Bioorg Med Chem Lett12:3077-9 (2002) Histamine H3 receptor
Name:Histamine H3 receptor
Type:G Protein-Coupled Receptor (GPCR)
Mol. Mass.:48607.98
Organism:Rattus norvegicus (rat)
Description:n/a
Residue:445
BDBM50217108
NameBDBM50217108
Synonyms:CHEMBL105594
TypeSmall organic molecule
Emp. Form.C20H23N3O
Mol. Mass.321.4161
SMILESN#Cc1ccc(cc1)-c1ccc(OCCCN2CCNCC2)cc1