Reaction Details
TargetHistamine H3 receptor
LigandBDBM50217096
Substrate/Competitorn/a
Meas. Tech.ChEMBL_85806 (CHEMBL697084)
Ki 6.2±n/a nM
Citation Faghih, RDwight, WVasudevan, ADinges, JConner, SEEsbenshade, TABennani, YLHancock, AA Aminoalkoxybiphenylnitriles as histamine-3 receptor ligands. Bioorg Med Chem Lett12:3077-9 (2002) Histamine H3 receptor
Name:Histamine H3 receptor
Type:G Protein-Coupled Receptor (GPCR)
Mol. Mass.:48691.47
Organism:Homo sapiens (Human)
Description:Binding assays were using CHO cells stably expressing hH3R receptors.
Residue:445
BDBM50217096
NameBDBM50217096
Synonyms:CHEMBL105267
TypeSmall organic molecule
Emp. Form.C20H23N3O
Mol. Mass.321.4161
SMILESN[C@@H]1CCN(CCCOc2ccc(cc2)-c2ccc(cc2)C#N)C1