Reaction Details
TargetHistamine H3 receptor
LigandBDBM50217413
Substrate/Competitorn/a
Meas. Tech.ChEMBL_86929 (CHEMBL697538)
Ki 15±n/a nM
Citation Faghih, RDwight, WVasudevan, ADinges, JConner, SEEsbenshade, TABennani, YLHancock, AA Aminoalkoxybiphenylnitriles as histamine-3 receptor ligands. Bioorg Med Chem Lett12:3077-9 (2002) Histamine H3 receptor
Name:Histamine H3 receptor
Type:G Protein-Coupled Receptor (GPCR)
Mol. Mass.:48607.98
Organism:Rattus norvegicus (rat)
Description:n/a
Residue:445
BDBM50217413
NameBDBM50217413
Synonyms:CHEMBL2112461
TypeSmall organic molecule
Emp. Form.C21H24N2O2
Mol. Mass.336.4275
SMILESC[C@@]1(O)CCN(CCCOc2ccc(cc2)-c2ccc(cc2)C#N)C1