Reaction Details
TargetHistamine H2 receptor
LigandBDBM50217100
Substrate/Competitorn/a
Meas. Tech.ChEMBL_85657 (CHEMBL702649)
Ki 100000±n/a nM
Citation Faghih, RDwight, WVasudevan, ADinges, JConner, SEEsbenshade, TABennani, YLHancock, AA Aminoalkoxybiphenylnitriles as histamine-3 receptor ligands. Bioorg Med Chem Lett12:3077-9 (2002) Histamine H2 receptor
Name:Histamine H2 receptor
Type:G Protein-Coupled Receptor (GPCR)
Mol. Mass.:40115.31
Organism:Homo sapiens (Human)
Description:n/a
Residue:359
BDBM50217100
NameBDBM50217100
Synonyms:CHEMBL105483
TypeSmall organic molecule
Emp. Form.C23H30N2O4
Mol. Mass.398.4953
SMILESCCOC(=O)N1CCN(CCCOc2ccc(cc2)-c2ccc(OC)cc2)CC1