Reaction Details
TargetHistamine H1 receptor
LigandBDBM50217416
Substrate/Competitorn/a
Meas. Tech.ChEMBL_84551 (CHEMBL692986)
Ki 3981±n/a nM
Citation Faghih, RDwight, WVasudevan, ADinges, JConner, SEEsbenshade, TABennani, YLHancock, AA Aminoalkoxybiphenylnitriles as histamine-3 receptor ligands. Bioorg Med Chem Lett12:3077-9 (2002) Histamine H1 receptor
Name:Histamine H1 receptor
Type:G Protein-Coupled Receptor (GPCR)
Mol. Mass.:55808.72
Organism:Homo sapiens (Human)
Description:Cell pellets from SK-N-MC cells transfected with human H1 receptor were used in binding assay.
Residue:487
BDBM50217416
NameBDBM50217416
Synonyms:CHEMBL105515
TypeSmall organic molecule
Emp. Form.C23H28N2O
Mol. Mass.348.4812
SMILESCC1CCCC(C)N1CCCOc1ccc(cc1)-c1ccc(cc1)C#N