Reaction Details
TargetHistamine H2 receptor
LigandBDBM50217104
Substrate/Competitorn/a
Meas. Tech.ChEMBL_85657 (CHEMBL702649)
Ki 69183±n/a nM
Citation Faghih, RDwight, WVasudevan, ADinges, JConner, SEEsbenshade, TABennani, YLHancock, AA Aminoalkoxybiphenylnitriles as histamine-3 receptor ligands. Bioorg Med Chem Lett12:3077-9 (2002) Histamine H2 receptor
Name:Histamine H2 receptor
Type:G Protein-Coupled Receptor (GPCR)
Mol. Mass.:40115.31
Organism:Homo sapiens (Human)
Description:n/a
Residue:359
BDBM50217104
NameBDBM50217104
Synonyms:CHEMBL104947
TypeSmall organic molecule
Emp. Form.C19H26N4O3
Mol. Mass.358.4347
SMILESCCOC(=O)N1CCN(CCCOc2ccc(cc2)-c2c[nH]cn2)CC1