Reaction Details
TargetHistamine H3 receptor
LigandBDBM50240709
Substrate/Competitorn/a
Meas. Tech.ChEMBL_86929 (CHEMBL697538)
Ki 13±n/a nM
Citation Faghih, RDwight, WVasudevan, ADinges, JConner, SEEsbenshade, TABennani, YLHancock, AA Aminoalkoxybiphenylnitriles as histamine-3 receptor ligands. Bioorg Med Chem Lett12:3077-9 (2002) Histamine H3 receptor
Name:Histamine H3 receptor
Type:G Protein-Coupled Receptor (GPCR)
Mol. Mass.:48607.98
Organism:Rattus norvegicus (rat)
Description:n/a
Residue:445
BDBM50240709
NameBDBM50240709
Synonyms:(R)-4'-(3-(3-(dimethylamino)pyrrolidin-1-yl)propoxy)biphenyl-4-carbonitrile A-331440 | CHEMBL319000
TypeSmall organic molecule
Emp. Form.C22H27N3O
Mol. Mass.349.4693
SMILESCN(C)[C@@H]1CCN(CCCOc2ccc(cc2)-c2ccc(cc2)C#N)C1