Reaction Details
TargetHistamine H1 receptor
LigandBDBM50217330
Substrate/Competitorn/a
Meas. Tech.ChEMBL_84551 (CHEMBL692986)
Ki 7762±n/a nM
Citation Faghih, RDwight, WVasudevan, ADinges, JConner, SEEsbenshade, TABennani, YLHancock, AA Aminoalkoxybiphenylnitriles as histamine-3 receptor ligands. Bioorg Med Chem Lett12:3077-9 (2002) Histamine H1 receptor
Name:Histamine H1 receptor
Type:G Protein-Coupled Receptor (GPCR)
Mol. Mass.:55808.72
Organism:Homo sapiens (Human)
Description:Cell pellets from SK-N-MC cells transfected with human H1 receptor were used in binding assay.
Residue:487
BDBM50217330
NameBDBM50217330
Synonyms:CHEMBL106596
TypeSmall organic molecule
Emp. Form.C21H24N2O2
Mol. Mass.336.4275
SMILESOC1CCCN(CCCOc2ccc(cc2)-c2ccc(cc2)C#N)C1