Reaction Details
TargetHistamine H1 receptor
LigandBDBM50217101
Substrate/Competitorn/a
Meas. Tech.ChEMBL_85804 (CHEMBL697082)
Ki 5012±n/a nM
Citation Faghih, RDwight, WVasudevan, ADinges, JConner, SEEsbenshade, TABennani, YLHancock, AA Aminoalkoxybiphenylnitriles as histamine-3 receptor ligands. Bioorg Med Chem Lett12:3077-9 (2002) Histamine H1 receptor
Name:Histamine H1 receptor
Type:G Protein-Coupled Receptor (GPCR)
Mol. Mass.:55808.72
Organism:Homo sapiens (Human)
Description:Cell pellets from SK-N-MC cells transfected with human H1 receptor were used in binding assay.
Residue:487
BDBM50217101
NameBDBM50217101
Synonyms:CHEMBL25688
TypeSmall organic molecule
Emp. Form.C20H22N2O
Mol. Mass.306.4015
SMILESN#Cc1ccc(cc1)-c1ccc(OCCCN2CCCC2)cc1