Reaction Details
TargetHistamine H3 receptor
LigandBDBM50217105
Substrate/Competitorn/a
Meas. Tech.ChEMBL_83794 (CHEMBL692571)
Ki 1000±n/a nM
Citation Faghih, RDwight, WVasudevan, ADinges, JConner, SEEsbenshade, TABennani, YLHancock, AA Aminoalkoxybiphenylnitriles as histamine-3 receptor ligands. Bioorg Med Chem Lett12:3077-9 (2002) Histamine H3 receptor
Name:Histamine H3 receptor
Type:G Protein-Coupled Receptor (GPCR)
Mol. Mass.:48691.47
Organism:Homo sapiens (Human)
Description:Binding assays were using CHO cells stably expressing hH3R receptors.
Residue:445
BDBM50217105
NameBDBM50217105
Synonyms:CHEMBL320178
TypeSmall organic molecule
Emp. Form.C23H27N3O3
Mol. Mass.393.4788
SMILESCCOC(=O)N1CCN(CCCOc2ccc(cc2)-c2ccc(cc2)C#N)CC1