Reaction Details
TargetHistamine H3 receptor
LigandBDBM50217409
Substrate/Competitorn/a
Meas. Tech.ChEMBL_85807 (CHEMBL697085)
Ki 191±n/a nM
Citation Faghih, RDwight, WVasudevan, ADinges, JConner, SEEsbenshade, TABennani, YLHancock, AA Aminoalkoxybiphenylnitriles as histamine-3 receptor ligands. Bioorg Med Chem Lett12:3077-9 (2002) Histamine H3 receptor
Name:Histamine H3 receptor
Type:G Protein-Coupled Receptor (GPCR)
Mol. Mass.:48607.98
Organism:Rattus norvegicus (rat)
Description:n/a
Residue:445
BDBM50217409
NameBDBM50217409
Synonyms:CHEMBL105385
TypeSmall organic molecule
Emp. Form.C22H27ClN2O3
Mol. Mass.402.914
SMILESCCOC(=O)N1CCN(CCCOc2ccc(cc2)-c2ccc(Cl)cc2)CC1