Reaction Details
TargetUDP-N-acetylmuramoylalanine--D-glutamate ligase
LigandBDBM50221032
Substrate/Competitorn/a
Meas. Tech.ChEMBL_212282 (CHEMBL819149)
IC50 34500±n/a nM
Citation Li, ZFrancisco, GDHu, WLabthavikul, PPetersen, PJSeverin, ASingh, GYang, YRasmussen, BALin, YISkotnicki, JSMansour, TS 2-Phenyl-5,6-dihydro-2H-thieno[3,2-c]pyrazol-3-ol derivatives as new inhibitors of bacterial cell wall biosynthesis. Bioorg Med Chem Lett13:2591-4 (2003) UDP-N-acetylmuramoylalanine--D-glutamate ligase
Name:UDP-N-acetylmuramoylalanine--D-glutamate ligase
Type:Protein
Mol. Mass.:49837.61
Organism:Staphylococcus aureus (Firmicutes)
Description:S. aureus MurD
Residue:449
BDBM50221032
NameBDBM50221032
Synonyms:CHEMBL86526
TypeSmall organic molecule
Emp. Form.C11H9N3O3S
Mol. Mass.263.272
SMILESOc1c2SCCc2nn1-c1cccc(c1)[N+]([O-])=O