Reaction Details
TargetUDP-N-acetylenolpyruvoylglucosamine reductase
LigandBDBM50221027
Substrate/Competitorn/a
Meas. Tech.ChEMBL_212271 (CHEMBL816295)
IC50 57500±n/a nM
Citation Li, ZFrancisco, GDHu, WLabthavikul, PPetersen, PJSeverin, ASingh, GYang, YRasmussen, BALin, YISkotnicki, JSMansour, TS 2-Phenyl-5,6-dihydro-2H-thieno[3,2-c]pyrazol-3-ol derivatives as new inhibitors of bacterial cell wall biosynthesis. Bioorg Med Chem Lett13:2591-4 (2003) UDP-N-acetylenolpyruvoylglucosamine reductase
Name:UDP-N-acetylenolpyruvoylglucosamine reductase
Type:Protein
Mol. Mass.:33791.48
Organism:Staphylococcus aureus (Firmicutes)
Description:S. aureus MurB
Residue:307
BDBM50221027
NameBDBM50221027
Synonyms:CHEMBL327438
TypeSmall organic molecule
Emp. Form.C12H9N3OS
Mol. Mass.243.284
SMILESOc1c2SCCc2nn1-c1cccc(c1)C#N