Reaction Details
TargetUDP-N-acetylenolpyruvoylglucosamine reductase
LigandBDBM50221031
Substrate/Competitorn/a
Meas. Tech.ChEMBL_212271 (CHEMBL816295)
IC50>96000±n/a nM
Citation Li, ZFrancisco, GDHu, WLabthavikul, PPetersen, PJSeverin, ASingh, GYang, YRasmussen, BALin, YISkotnicki, JSMansour, TS 2-Phenyl-5,6-dihydro-2H-thieno[3,2-c]pyrazol-3-ol derivatives as new inhibitors of bacterial cell wall biosynthesis. Bioorg Med Chem Lett13:2591-4 (2003) UDP-N-acetylenolpyruvoylglucosamine reductase
Name:UDP-N-acetylenolpyruvoylglucosamine reductase
Type:Protein
Mol. Mass.:33791.48
Organism:Staphylococcus aureus (Firmicutes)
Description:S. aureus MurB
Residue:307
BDBM50221031
NameBDBM50221031
Synonyms:CHEMBL315456
TypeSmall organic molecule
Emp. Form.C14H16N2OS
Mol. Mass.260.355
SMILESCC(C)c1ccc(cc1)-n1nc2CCSc2c1O