Reaction Details
TargetUDP-N-acetylenolpyruvoylglucosamine reductase
LigandBDBM50221040
Substrate/Competitorn/a
Meas. Tech.ChEMBL_212272 (CHEMBL816135)
IC50>87000±n/a nM
Citation Li, ZFrancisco, GDHu, WLabthavikul, PPetersen, PJSeverin, ASingh, GYang, YRasmussen, BALin, YISkotnicki, JSMansour, TS 2-Phenyl-5,6-dihydro-2H-thieno[3,2-c]pyrazol-3-ol derivatives as new inhibitors of bacterial cell wall biosynthesis. Bioorg Med Chem Lett13:2591-4 (2003) UDP-N-acetylenolpyruvoylglucosamine reductase
Name:UDP-N-acetylenolpyruvoylglucosamine reductase
Type:Protein
Mol. Mass.:33791.48
Organism:Staphylococcus aureus (Firmicutes)
Description:S. aureus MurB
Residue:307
BDBM50221040
NameBDBM50221040
Synonyms:CHEMBL83020
TypeSmall organic molecule
Emp. Form.C11H8Cl2N2OS
Mol. Mass.287.165
SMILESOc1c2CSCc2nn1-c1ccc(Cl)c(Cl)c1