Reaction Details
Target5-hydroxytryptamine receptor 1A
LigandBDBM50228684
Substrate/Competitorn/a
Meas. Tech.ChEMBL_1505 (CHEMBL616337)
Ki 13±n/a nM
Citation Clark, RDWeinhardt, KKBerger, JFisher, LEBrown, CMMacKinnon, ACKilpatrick, ATSpedding, M 1,9-Alkano-bridged 2,3,4,5-tetrahydro-1H-3-benzazepines with affinity for the alpha 2-adrenoceptor and the 5-HT1A receptor. J Med Chem33:633-41 (1990) 5-hydroxytryptamine receptor 1A
Name:5-hydroxytryptamine receptor 1A
Type:G Protein-Coupled Receptor (GPCR)
Mol. Mass.:46445.29
Organism:Rattus norvegicus (rat)
Description:Binding assays were performed using rat hippocampal membranes.
Residue:422
BDBM50228684
NameBDBM50228684
Synonyms:CHEMBL1203597
TypeSmall organic molecule
Emp. Form.C17H24ClNO
Mol. Mass.293.832
SMILESCl.COc1ccc2CCCC3CN(CC=C)CCc1c23