Reaction Details
Target5-hydroxytryptamine receptor 1A
LigandBDBM50228683
Substrate/Competitorn/a
Meas. Tech.ChEMBL_1505 (CHEMBL616337)
Ki 32±n/a nM
Citation Clark, RDWeinhardt, KKBerger, JFisher, LEBrown, CMMacKinnon, ACKilpatrick, ATSpedding, M 1,9-Alkano-bridged 2,3,4,5-tetrahydro-1H-3-benzazepines with affinity for the alpha 2-adrenoceptor and the 5-HT1A receptor. J Med Chem33:633-41 (1990) 5-hydroxytryptamine receptor 1A
Name:5-hydroxytryptamine receptor 1A
Type:G Protein-Coupled Receptor (GPCR)
Mol. Mass.:46445.29
Organism:Rattus norvegicus (rat)
Description:Binding assays were performed using rat hippocampal membranes.
Residue:422
BDBM50228683
NameBDBM50228683
Synonyms:CHEMBL348058
TypeSmall organic molecule
Emp. Form.C16H22ClN
Mol. Mass.263.806
SMILESCCCN1CCc2c(Cl)ccc3CCCC(C1)c23