Reaction Details
Target5-hydroxytryptamine receptor 1A
LigandBDBM50228686
Substrate/Competitorn/a
Meas. Tech.ChEMBL_1505 (CHEMBL616337)
Ki 20±n/a nM
Citation Clark, RDWeinhardt, KKBerger, JFisher, LEBrown, CMMacKinnon, ACKilpatrick, ATSpedding, M 1,9-Alkano-bridged 2,3,4,5-tetrahydro-1H-3-benzazepines with affinity for the alpha 2-adrenoceptor and the 5-HT1A receptor. J Med Chem33:633-41 (1990) 5-hydroxytryptamine receptor 1A
Name:5-hydroxytryptamine receptor 1A
Type:G Protein-Coupled Receptor (GPCR)
Mol. Mass.:46445.29
Organism:Rattus norvegicus (rat)
Description:Binding assays were performed using rat hippocampal membranes.
Residue:422
BDBM50228686
NameBDBM50228686
Synonyms:CHEMBL160607
TypeSmall organic molecule
Emp. Form.C14H18ClN
Mol. Mass.235.752
SMILES[H][C@]12CCCc3ccc(Cl)c(CCN(C)C1)c23