Reaction Details
TargetPhosphatidylinositol 4,5-bisphosphate 3-kinase catalytic subunit delta isoform
LigandBDBM50232446
Substrate/Competitorn/a
Meas. Tech.ChEMBL_1647788 (CHEMBL3996844)
IC50 5.0±n/a nM
Citation Qin, LYRuan, ZCherney, RJDhar, TGMNeels, JWeigelt, CASack, JSSrivastava, ASCornelius, LAMTino, JAStefanski, KGu, XXie, JSusulic, VYang, XYarde-Chinn, MSkala, SBosnius, RGoldstein, CDavies, PRuepp, SSalter-Cid, LBhide, RSPoss, MA Discovery of 7-(3-(piperazin-1-yl)phenyl)pyrrolo[2,1-f][1,2,4]triazin-4-amine derivatives as highly potent and selective PI3Kd inhibitors. Bioorg Med Chem Lett27:855-861 (2017) 
 
Phosphatidylinositol 4,5-bisphosphate 3-kinase catalytic subunit delta isoform
Name:Phosphatidylinositol 4,5-bisphosphate 3-kinase catalytic subunit delta isoform
Type:Enzyme Subunit
Mol. Mass.:119489.41
Organism:Homo sapiens (Human)
Description:O00329
Residue:1044
BDBM50232446
NameBDBM50232446
Synonyms:CHEMBL4098095
TypeSmall organic molecule
Emp. Form.C24H28N8O
Mol. Mass.444.5321
SMILESNc1ncnn2c(cc(-c3ccnn3C3CCOCC3)c12)-c1cccc(c1)N1CCNCC1