Reaction Details
TargetPhosphatidylinositol 4,5-bisphosphate 3-kinase catalytic subunit delta isoform
LigandBDBM284821
Substrate/Competitorn/a
Meas. Tech.ChEMBL_1647788 (CHEMBL3996844)
IC50 0.600000±n/a nM
Citation Qin, LYRuan, ZCherney, RJDhar, TGMNeels, JWeigelt, CASack, JSSrivastava, ASCornelius, LAMTino, JAStefanski, KGu, XXie, JSusulic, VYang, XYarde-Chinn, MSkala, SBosnius, RGoldstein, CDavies, PRuepp, SSalter-Cid, LBhide, RSPoss, MA Discovery of 7-(3-(piperazin-1-yl)phenyl)pyrrolo[2,1-f][1,2,4]triazin-4-amine derivatives as highly potent and selective PI3Kd inhibitors. Bioorg Med Chem Lett27:855-861 (2017) 
 
Phosphatidylinositol 4,5-bisphosphate 3-kinase catalytic subunit delta isoform
Name:Phosphatidylinositol 4,5-bisphosphate 3-kinase catalytic subunit delta isoform
Type:Enzyme Subunit
Mol. Mass.:119489.41
Organism:Homo sapiens (Human)
Description:O00329
Residue:1044
BDBM284821
NameBDBM284821
Synonyms:1-((cis)-4-(5-(4-amino-5-(1-(tetrahydro-2H-pyran-4-yl)-1H- pyrazol-5-yl)pyrrolo[2,1-f][1,2,4]triazin-7-yl)pyridin-3-yl)-3,5- dimethylpiperazin-1-yl)ethanone | US10023576, Example 11
TypeSmall organic molecule
Emp. Form.C27H33N9O2
Mol. Mass.515.61
SMILESC[C@H]1CN(C[C@@H](C)N1c1cncc(c1)-c1cc(-c2ccnn2C2CCOCC2)c2c(N)ncnn12)C(C)=O