Reaction Details
TargetHigh affinity nerve growth factor receptor
LigandBDBM50232542
Substrate/Competitorn/a
Meas. Tech.ChEMBL_1647981 (CHEMBL3997037)
IC50 2.7±n/a nM
Citation Furuya, NMomose, TKatsuno, KFushimi, NMuranaka, HHanda, COzawa, TKinoshita, T The juxtamembrane region of TrkA kinase is critical for inhibitor selectivity. Bioorg Med Chem Lett27:1233-1236 (2017) 
 
High affinity nerve growth factor receptor
Name:High affinity nerve growth factor receptor
Type:n/a
Mol. Mass.:87498.18
Organism:Homo sapiens (Human)
Description:P04629
Residue:796
BDBM50232542
NameBDBM50232542
Synonyms:CHEMBL4090531 | US10323022, Example 135
TypeSmall organic molecule
Emp. Form.C26H31F2N5O3
Mol. Mass.499.5528
SMILESCCOc1nn(c(NC(=O)N[C@@H]2CN(CCOC)C[C@H]2c2ccc(F)c(F)c2)c1C)-c1ccccc1