Reaction Details
TargetHigh affinity nerve growth factor receptor
LigandBDBM50392788
Substrate/Competitorn/a
Meas. Tech.ChEMBL_1647978 (CHEMBL3997034)
IC50 3.2±n/a nM
Citation Furuya, NMomose, TKatsuno, KFushimi, NMuranaka, HHanda, COzawa, TKinoshita, T The juxtamembrane region of TrkA kinase is critical for inhibitor selectivity. Bioorg Med Chem Lett27:1233-1236 (2017) 
 
High affinity nerve growth factor receptor
Name:High affinity nerve growth factor receptor
Type:n/a
Mol. Mass.:87498.18
Organism:Homo sapiens (Human)
Description:P04629
Residue:796
BDBM50392788
NameBDBM50392788
Synonyms:CHEMBL457614
TypeSmall organic molecule
Emp. Form.C17H19ClFN7O
Mol. Mass.391.83
SMILESCC(C)Oc1cc(Nc2nc(N[C@@H](C)c3ccc(F)cn3)ncc2Cl)[nH]n1